Target
Tyrosine-protein phosphatase non-receptor type 11
Ligand
BDBM50342004
Substrate
Meas. Tech.
ChEMBL_743510 (CHEMBL1767951)
Ki
700±n/a nM
Citation
 Vintonyak, VVWaldmann, HRauh, D Using small molecules to target protein phosphatases. Bioorg Med Chem 19:2145-55 (2011)  
Target
Name:
Tyrosine-protein phosphatase non-receptor type 11
Synonyms:
3.1.3.48 PTP-1D PTP2C Protein Tyrosine Phosphatase PPN11/Shp2 Protein-Tyrosine Phosphatase SHP-2 Protein-tyrosine phosphatase 2C SH-PTP3 SHP2 Src homology phosphatase 2 (SHP-2) Tyrosine-protein phosphatase non-receptor type 11 (SHP-2) | Tyrosine-protein phosphatase non-receptor type 11 (SHP2)
Type:
Protein phosphatase
Mol. Mass.:
68443.59
Organism:
Homo sapiens (Human)
Description:
Q06124
Residue:
593
  
Inhibitor
Name:
BDBM50342004
Synonyms:
4-(2-(3-(4-nitrophenyl)-5-oxo-1-phenyl-1H-pyrazol-4(5H)-ylidene)hydrazinyl)benzenesulfonic acid | CHEMBL1765357
Type:
Small organic molecule
Emp. Form.:
C21H15N5O6S
Mol. Mass.:
465.439
SMILES:
OS(=O)(=O)c1ccc(cc1)N=Nc1c([nH]n(-c2ccccc2)c1=O)-c1ccc(cc1)[N+]([O-])=O
: