Target
Disintegrin and metalloproteinase domain-containing protein 17
Ligand
BDBM50343962
Substrate
Meas. Tech.
ChEMBL_748329 (CHEMBL1781453)
Ki
37±n/a nM
Citation
 Li, DPopovici-Muller, JBelanger, DBCaldwell, JDai, CDavid, MGirijavallabhan, VMLavey, BJLee, JFLiu, ZMazzola, RRizvi, RRosner, KEShankar, BSpitler, JTing, PCVaccaro, HYu, WZhou, GZhu, ZNiu, XSun, JGuo, ZOrth, PChen, SKozlowski, JALundell, DJMadison, VMcKittrick, BPiwinski, JJShih, NYShipps, GWSiddiqui, MAStrickland, CO Structure and activity relationships of tartrate-based TACE inhibitors. Bioorg Med Chem Lett 20:4812-5 (2010)  
Target
Name:
Disintegrin and metalloproteinase domain-containing protein 17
Synonyms:
ADA17_HUMAN CSVP Disintegrin and metalloproteinase domain-containing protein 17 (ADAM17) TNF-alpha convertase TNF-alpha-converting enzyme (TACE) Tumor necrosis factor-α converting enzyme (TACE)
Type:
Enzyme
Mol. Mass.:
93007.89
Organism:
Homo sapiens (Human)
Description:
Residue:
824
  
Inhibitor
Name:
BDBM50343962
Synonyms:
(2R,3R)-N-((5-(4-chlorobenzyl)thiophen-2-yl)methyl)-4-((R)-2-(3-chlorophenyl)pyrrolidin-1-yl)-2,3-dihydroxy-4-oxobutanamide | CHEMBL1779597
Type:
Small organic molecule
Emp. Form.:
C26H26Cl2N2O4S
Mol. Mass.:
533.467
SMILES:
O[C@H]([C@@H](O)C(=O)N1CCC[C@@H]1c1cccc(Cl)c1)C(=O)NCc1ccc(Cc2ccc(Cl)cc2)s1
: