Target
Muscarinic acetylcholine receptor M2
Ligand
BDBM50344292
Substrate
Meas. Tech.
ChEMBL_748301 (CHEMBL1781311)
IC50
1.1±n/a nM
Citation
 Prat, MBuil, MAFernández, MDCastro, JMonleón, JMTort, LCasals, GFerrer, MHuerta, JMEspinosa, SLópez, MSegarra, VGavaldà, AMiralpeix, MRamos, IVilella, DGonzález, MCórdoba, MCárdenas, AAntón, FBeleta, JRyder, H Discovery of novel quaternary ammonium derivatives of (3R)-quinuclidinyl carbamates as potent and long acting muscarinic antagonists. Bioorg Med Chem Lett 21:3457-61 (2011)  
Target
Name:
Muscarinic acetylcholine receptor M2
Synonyms:
ACM2_HUMAN Cholinergic, muscarinic M2 Muscarinic acetylcholine receptor M2 and M5 | RecName: Full=Muscarinic acetylcholine receptor M2
Type:
GPCR
Mol. Mass.:
51730.61
Organism:
Homo sapiens (Human)
Description:
P08172
Residue:
466
  
Inhibitor
Name:
BDBM50344292
Synonyms:
(R)-1-(2-phenoxyethyl)-3-(phenyl(thiophen-2-ylmethyl)carbamoyloxy)-1-azoniabicyclo[2.2.2]octane bromide | CHEMBL1779131
Type:
Small organic molecule
Emp. Form.:
C27H31N2O3S
Mol. Mass.:
463.611
SMILES:
O=C(O[C@H]1C[N+]2(CCOc3ccccc3)CCC1CC2)N(Cc1cccs1)c1ccccc1
: