Target
Tyrosine-protein phosphatase non-receptor type 11
Ligand
BDBM50348092
Substrate
Meas. Tech.
ChEMBL_757519 (CHEMBL1804491)
Ki
4600±n/a nM
Citation
 Yu, ZHChen, LWu, LLiu, SWang, LZhang, ZY Small molecule inhibitors of SHP2 tyrosine phosphatase discovered by virtual screening. Bioorg Med Chem Lett 21:4238-42 (2011)  
Target
Name:
Tyrosine-protein phosphatase non-receptor type 11
Synonyms:
3.1.3.48 PTP-1D PTP2C Protein Tyrosine Phosphatase PPN11/Shp2 Protein-Tyrosine Phosphatase SHP-2 Protein-tyrosine phosphatase 2C SH-PTP3 SHP2 Src homology phosphatase 2 (SHP-2) Tyrosine-protein phosphatase non-receptor type 11 (SHP-2) | Tyrosine-protein phosphatase non-receptor type 11 (SHP2)
Type:
Protein phosphatase
Mol. Mass.:
68443.59
Organism:
Homo sapiens (Human)
Description:
Q06124
Residue:
593
  
Inhibitor
Name:
BDBM50348092
Synonyms:
CHEMBL1800273
Type:
Small organic molecule
Emp. Form.:
C11H10N2O9S2
Mol. Mass.:
378.335
SMILES:
Cc1cc(c(cc1-n1[nH]c(cc1=O)C(O)=O)S(O)(=O)=O)S(O)(=O)=O
: