Target
Neuropeptide Y receptor type 5
Ligand
BDBM50354078
Substrate
Meas. Tech.
ChEMBL_770872 (CHEMBL1837820)
Ki
1.7±n/a nM
Citation
 Packiarajan, MMarzabadi, MRDesai, MLu, YNoble, SAWong, WCJubian, VChandrasena, GWolinsky, TDZhong, HWalker, MWWiborg, OAndersen, K Discovery of Lu AA33810: a highly selective and potent NPY5 antagonist with in vivo efficacy in a model of mood disorder. Bioorg Med Chem Lett 21:5436-41 (2011)  
Target
Name:
Neuropeptide Y receptor type 5
Synonyms:
NPY-Y5 NPY5-R NPY5R_HUMAN NPYY5 Neuropeptide Y receptor type 5 ( NPY Y5) | Y5 receptor
Type:
Enzyme
Mol. Mass.:
50746.64
Organism:
Homo sapiens (Human)
Description:
Q15761
Residue:
445
  
Inhibitor
Name:
BDBM50354078
Synonyms:
CHEMBL1836330
Type:
Small organic molecule
Emp. Form.:
C17H22FN3O2S3
Mol. Mass.:
415.569
SMILES:
CS(=O)(=O)NCCCCCNc1nc-2c(CCSc3ccc(F)cc-23)s1
: