Target
Tyrosine-protein kinase Lck
Ligand
BDBM50354435
Substrate
Meas. Tech.
ChEMBL_771348 (CHEMBL1839620)
IC50
539±n/a nM
Citation
 Zeng, HBelanger, DBCurran, PJShipps, GWMiao, HBracken, JBArshad Siddiqui, MMalkowski, MWang, Y Discovery of novel imidazo[1,2-a]pyrazin-8-amines as Brk/PTK6 inhibitors. Bioorg Med Chem Lett 21:5870-5 (2011)  
Target
Name:
Tyrosine-protein kinase Lck
Synonyms:
2.7.10.2 LCK_HUMAN Leukocyte C-terminal Src kinase Lymphocyte-specific protein tyrosine kinase Protein YT16 Proto-oncogene tyrosine-protein kinase LCK T cell-specific protein-tyrosine kinase
Type:
Mol. Mass.:
57987.83
Organism:
Homo sapiens (Human)
Description:
P06239
Residue:
509
  
Inhibitor
Name:
BDBM50354435
Synonyms:
CHEMBL1836839
Type:
Small organic molecule
Emp. Form.:
C23H23ClN8O
Mol. Mass.:
462.935
SMILES:
Cc1cn2c(cnc2c(Nc2ccc(C(=O)N3CCNC4(CC4)C3)c(Cl)c2)n1)-c1cn[nH]c1
: