Target
SRSF protein kinase 2
Ligand
BDBM50193995
Substrate
Meas. Tech.
ChEMBL_774248 (CHEMBL1908465)
Kd
>10000±n/a nM
Citation
 Davis, MIHunt, JPHerrgard, SCiceri, PWodicka, LMPallares, GHocker, MTreiber, DKZarrinkar, PP Comprehensive analysis of kinase inhibitor selectivity. Nat Biotechnol 29:1046-51 (2011)  
Target
Name:
SRSF protein kinase 2
Synonyms:
SFRS protein kinase 2 SRPK2 SRSF protein kinase 2 SRSF protein kinase 2 N-terminal Serine/threonine-protein kinase SRPK2
Type:
PROTEIN
Mol. Mass.:
77488.98
Organism:
Homo sapiens (Human)
Description:
ChEMBL_774248
Residue:
688
  
Inhibitor
Name:
BDBM50193995
Synonyms:
3-((3R,4R)-4-methyl-3-(methyl(7H-pyrrolo[2,3-d]pyrimidin-4-yl)amino)piperidin-1-yl)-3-oxopropanenitrile 3-{(3R,4R)-4-methyl-3-[methyl(7H-pyrrolo[2,3-d]pyrimidin-4-yl)amino]piperidin-1-yl}-3-oxopropanenitrile CP-690550 Tofacitinib US10112907, Example 00035 US10766894, Compound TABLE 1.20 US11078206, Example Tofacitinib US11339167, Example Tofacitinib
Type:
Small organic molecule
Emp. Form.:
C16H20N6O
Mol. Mass.:
312.3696
SMILES:
C[C@@H]1CCN(C[C@@H]1N(C)c1ncnc2[nH]ccc12)C(=O)CC#N
: