Target
Serine/threonine-protein kinase 32B
Ligand
BDBM50326053
Substrate
Meas. Tech.
ChEMBL_774592 (CHEMBL1908809)
Kd
>10000±n/a nM
Citation
 Davis, MIHunt, JPHerrgard, SCiceri, PWodicka, LMPallares, GHocker, MTreiber, DKZarrinkar, PP Comprehensive analysis of kinase inhibitor selectivity. Nat Biotechnol 29:1046-51 (2011)  
Target
Name:
Serine/threonine-protein kinase 32B
Synonyms:
ST32B_HUMAN YANK2
Type:
PROTEIN
Mol. Mass.:
47892.49
Organism:
Homo sapiens (Human)
Description:
ChEMBL_587221
Residue:
414
  
Inhibitor
Name:
BDBM50326053
Synonyms:
CHEMBL608533 | PKC-412
Type:
Small organic molecule
Emp. Form.:
C35H30N4O4
Mol. Mass.:
570.6371
SMILES:
CO[C@@H]1[C@@H](C[C@H]2O[C@]1(C)n1c3ccccc3c3c4CNC(=O)c4c4c5ccccc5n2c4c13)N(C)C(=O)c1ccccc1
: