Target
Myosin-IIIb
Ligand
BDBM15138
Substrate
Meas. Tech.
ChEMBL_774297 (CHEMBL1908514)
Kd
>10000±n/a nM
Citation
 Davis, MIHunt, JPHerrgard, SCiceri, PWodicka, LMPallares, GHocker, MTreiber, DKZarrinkar, PP Comprehensive analysis of kinase inhibitor selectivity. Nat Biotechnol 29:1046-51 (2011)  
Target
Name:
Myosin-IIIb
Synonyms:
MYO3B | MYO3B_HUMAN
Type:
PROTEIN
Mol. Mass.:
151861.71
Organism:
Homo sapiens (Human)
Description:
ChEMBL_774297
Residue:
1341
  
Inhibitor
Name:
BDBM15138
Synonyms:
5-indazolyl pyridine 11g A-674563 indazole-pyridine, 7
Type:
Small organic molecule
Emp. Form.:
C22H22N4O
Mol. Mass.:
358.4363
SMILES:
Cc1n[nH]c2ccc(cc12)-c1cncc(OC[C@@H](N)Cc2ccccc2)c1
: