Target
Ribosomal protein S6 kinase alpha-6
Ligand
BDBM31085
Substrate
Meas. Tech.
ChEMBL_774562 (CHEMBL1908779)
Kd
3400±n/a nM
Citation
 Davis, MIHunt, JPHerrgard, SCiceri, PWodicka, LMPallares, GHocker, MTreiber, DKZarrinkar, PP Comprehensive analysis of kinase inhibitor selectivity. Nat Biotechnol 29:1046-51 (2011)  
Target
Name:
Ribosomal protein S6 kinase alpha-6
Synonyms:
90 kDa ribosomal protein S6 kinase 6 RPS6KA6 RPS6KA6(Kin.Dom.2 - C-terminal) RSK4 Ribosomal S6 kinase 4 Ribosomal protein S6 kinase alpha 6 (RSK4) S6K-alpha 6 p90RSK | pp90RSK4
Type:
Serine/threonine-protein kinase
Mol. Mass.:
83868.06
Organism:
Homo sapiens (Human)
Description:
Residue:
745
  
Inhibitor
Name:
BDBM31085
Synonyms:
1-[4-[(4-ethyl-1-piperazinyl)methyl]-3-(trifluoromethyl)phenyl]-3-[4-[[6-(methylamino)-4-pyrimidinyl]oxy]phenyl]urea 1-[4-[(4-ethylpiperazino)methyl]-3-(trifluoromethyl)phenyl]-3-[4-[6-(methylamino)pyrimidin-4-yl]oxyphenyl]urea cid_11409972
Type:
Small organic molecule
Emp. Form.:
C26H30F3N7O2
Mol. Mass.:
529.5573
SMILES:
CCN1CCN(Cc2ccc(NC(=O)Nc3ccc(Oc4cc(NC)ncn4)cc3)cc2C(F)(F)F)CC1
: