Target
Serine/threonine-protein kinase Nek4
Ligand
BDBM50355494
Substrate
Meas. Tech.
ChEMBL_774384 (CHEMBL1908601)
Kd
>10000±n/a nM
Citation
 Davis, MIHunt, JPHerrgard, SCiceri, PWodicka, LMPallares, GHocker, MTreiber, DKZarrinkar, PP Comprehensive analysis of kinase inhibitor selectivity. Nat Biotechnol 29:1046-51 (2011)  
Target
Name:
Serine/threonine-protein kinase Nek4
Synonyms:
NEK kinase NEK4_HUMAN | STK2
Type:
PROTEIN
Mol. Mass.:
94610.21
Organism:
Homo sapiens (Human)
Description:
ChEMBL_774384
Residue:
841
  
Inhibitor
Name:
BDBM50355494
Synonyms:
CHEMBL1908396
Type:
Small organic molecule
Emp. Form.:
C24H24N4O5S
Mol. Mass.:
480.536
SMILES:
COc1cc(Oc2ccnc3cc(OC)c(OC)cc23)ccc1NC(=O)NC(C)c1nccs1
: