Target
Serine/threonine-protein kinase tousled-like 1
Ligand
BDBM50306682
Substrate
Meas. Tech.
ChEMBL_774549 (CHEMBL1908766)
Kd
>10000±n/a nM
Citation
 Davis, MIHunt, JPHerrgard, SCiceri, PWodicka, LMPallares, GHocker, MTreiber, DKZarrinkar, PP Comprehensive analysis of kinase inhibitor selectivity. Nat Biotechnol 29:1046-51 (2011)  
Target
Name:
Serine/threonine-protein kinase tousled-like 1
Synonyms:
KIAA0137 TLK1 | TLK1_HUMAN
Type:
Enzyme Catalytic Domain
Mol. Mass.:
86722.30
Organism:
Homo sapiens (Human)
Description:
gi_33636698
Residue:
766
  
Inhibitor
Name:
BDBM50306682
Synonyms:
(R)-3-(1-(2,6-dichloro-3-fluorophenyl)ethoxy)-5-(1-(piperidin-4-yl)-1H-pyrazol-4-yl)pyridin-2-amine 3-[(1R)-1-(2,6-dichloro-3-fluorophenyl)ethoxy]-5-(1-piperidin-4-yl-1H-pyrazol-4-yl)pyridin-2-amine CRIZOTINIB US10370379, Crizotinib US10780082, Compound Crizotinib US11517561, Compound Crizotinib US9199944, Crizotinib | US9226923, Crizotinib
Type:
Small organic molecule
Emp. Form.:
C21H22Cl2FN5O
Mol. Mass.:
450.337
SMILES:
C[C@@H](Oc1cc(cnc1N)-c1cnn(c1)C1CCNCC1)c1c(Cl)ccc(F)c1Cl
: