Target
Serine/threonine-protein kinase/endoribonuclease IRE1
Ligand
BDBM12621
Substrate
Meas. Tech.
ChEMBL_774315 (CHEMBL1908532)
Kd
>10000±n/a nM
Citation
 Davis, MIHunt, JPHerrgard, SCiceri, PWodicka, LMPallares, GHocker, MTreiber, DKZarrinkar, PP Comprehensive analysis of kinase inhibitor selectivity. Nat Biotechnol 29:1046-51 (2011)  
Target
Name:
Serine/threonine-protein kinase/endoribonuclease IRE1
Synonyms:
ERN1 Endoplasmic reticulum-to-nucleus signaling 1 IRE1 Inositol requiring enzyme 1 (IRE-1alpha) Inositol-requiring protein 1 Ire1-alpha Serine/threonine-protein kinase/endoribonuclease IRE1 hIRE1p
Type:
Enzyme
Mol. Mass.:
109731.20
Organism:
Homo sapiens (Human)
Description:
O75460
Residue:
977
  
Inhibitor
Name:
BDBM12621
Synonyms:
2,4-Diamino-5-ketopyrimidine 39 R547 | [4-Amino-2-(1-methanesulfonylpiperidin-4-ylamino)pyrimidin-5-yl](2,3-difluoro-6-methoxyphenyl)methanone
Type:
Small organic molecule
Emp. Form.:
C18H21F2N5O4S
Mol. Mass.:
441.452
SMILES:
COc1ccc(F)c(F)c1C(=O)c1cnc(NC2CCN(CC2)S(C)(=O)=O)nc1N
: