Target
Serine/threonine-protein kinase NIM1
Ligand
BDBM6568
Substrate
Meas. Tech.
ChEMBL_774208 (CHEMBL1908425)
Kd
6400±n/a nM
Citation
 Davis, MIHunt, JPHerrgard, SCiceri, PWodicka, LMPallares, GHocker, MTreiber, DKZarrinkar, PP Comprehensive analysis of kinase inhibitor selectivity. Nat Biotechnol 29:1046-51 (2011)  
Target
Name:
Serine/threonine-protein kinase NIM1
Synonyms:
NIM1 NIM1_HUMAN
Type:
PROTEIN
Mol. Mass.:
49617.55
Organism:
Homo sapiens (Human)
Description:
ChEMBL_1510633
Residue:
436
  
Inhibitor
Name:
BDBM6568
Synonyms:
6-(2,6-dichlorophenyl)-8-methyl-2-{[3-(methylsulfanyl)phenyl]amino}-7H,8H-pyrido[2,3-d]pyrimidin-7-one PD-173955 US11136333, Compound PD173955
Type:
Small organic molecule
Emp. Form.:
C21H16Cl2N4OS
Mol. Mass.:
443.349
SMILES:
CSc1cccc(Nc2ncc3cc(-c4c(Cl)cccc4Cl)c(=O)n(C)c3n2)c1
: