Target
Tyrosine-protein kinase Fgr
Ligand
BDBM50355504
Substrate
Meas. Tech.
ChEMBL_774491 (CHEMBL1908708)
Kd
40±n/a nM
Citation
 Davis, MIHunt, JPHerrgard, SCiceri, PWodicka, LMPallares, GHocker, MTreiber, DKZarrinkar, PP Comprehensive analysis of kinase inhibitor selectivity. Nat Biotechnol 29:1046-51 (2011)  
Target
Name:
Tyrosine-protein kinase Fgr
Synonyms:
FGR Gardner-Rasheed feline sarcoma viral (v-fgr) oncogene homolog SRC p55-Fgr p58c-Fgr
Type:
protein
Mol. Mass.:
59469.88
Organism:
Homo sapiens (Human)
Description:
P09769
Residue:
529
  
Inhibitor
Name:
BDBM50355504
Synonyms:
CHEMBL1908393
Type:
Small organic molecule
Emp. Form.:
C34H36F2N4O6
Mol. Mass.:
634.6696
SMILES:
COc1cc2c(Oc3ccc(NC(=O)C4(CC4)C(=O)NC4=CCC(F)C=C4)cc3F)ccnc2cc1OCCCN1CCOCC1
: