Target
Serine/threonine-protein kinase PAK 2
Ligand
BDBM31085
Substrate
Meas. Tech.
ChEMBL_774352 (CHEMBL1908569)
Kd
>10000±n/a nM
Citation
 Davis, MIHunt, JPHerrgard, SCiceri, PWodicka, LMPallares, GHocker, MTreiber, DKZarrinkar, PP Comprehensive analysis of kinase inhibitor selectivity. Nat Biotechnol 29:1046-51 (2011)  
Target
Name:
Serine/threonine-protein kinase PAK 2
Synonyms:
PAK2 Serine/threonine-protein kinase PAK 1/PAK 2/PAK 3 Serine/threonine-protein kinase PAK 2 (PAK2) | p21-Activated kinase 2 (PAK2)
Type:
Enzyme
Mol. Mass.:
58037.40
Organism:
Homo sapiens (Human)
Description:
Q13177
Residue:
524
  
Inhibitor
Name:
BDBM31085
Synonyms:
1-[4-[(4-ethyl-1-piperazinyl)methyl]-3-(trifluoromethyl)phenyl]-3-[4-[[6-(methylamino)-4-pyrimidinyl]oxy]phenyl]urea 1-[4-[(4-ethylpiperazino)methyl]-3-(trifluoromethyl)phenyl]-3-[4-[6-(methylamino)pyrimidin-4-yl]oxyphenyl]urea cid_11409972
Type:
Small organic molecule
Emp. Form.:
C26H30F3N7O2
Mol. Mass.:
529.5573
SMILES:
CCN1CCN(Cc2ccc(NC(=O)Nc3ccc(Oc4cc(NC)ncn4)cc3)cc2C(F)(F)F)CC1
: