Target
Phosphatidylinositol 4-phosphate 3-kinase C2 domain-containing subunit beta
Ligand
BDBM31085
Substrate
Meas. Tech.
ChEMBL_774357 (CHEMBL1908574)
Kd
>10000±n/a nM
Citation
 Davis, MIHunt, JPHerrgard, SCiceri, PWodicka, LMPallares, GHocker, MTreiber, DKZarrinkar, PP Comprehensive analysis of kinase inhibitor selectivity. Nat Biotechnol 29:1046-51 (2011)  
Target
Name:
Phosphatidylinositol 4-phosphate 3-kinase C2 domain-containing subunit beta
Synonyms:
C2-PI3K PI3K-C2beta Phosphatidylinositol 4-phosphate 3-kinase C2 beta (PIK3C2B) Phosphoinositide 3-Kinase (PI3K), C2beta PtdIns-3-kinase C2 beta
Type:
Enzyme
Mol. Mass.:
184784.86
Organism:
Homo sapiens (Human)
Description:
O00750
Residue:
1634
  
Inhibitor
Name:
BDBM31085
Synonyms:
1-[4-[(4-ethyl-1-piperazinyl)methyl]-3-(trifluoromethyl)phenyl]-3-[4-[[6-(methylamino)-4-pyrimidinyl]oxy]phenyl]urea 1-[4-[(4-ethylpiperazino)methyl]-3-(trifluoromethyl)phenyl]-3-[4-[6-(methylamino)pyrimidin-4-yl]oxyphenyl]urea cid_11409972
Type:
Small organic molecule
Emp. Form.:
C26H30F3N7O2
Mol. Mass.:
529.5573
SMILES:
CCN1CCN(Cc2ccc(NC(=O)Nc3ccc(Oc4cc(NC)ncn4)cc3)cc2C(F)(F)F)CC1
: