Target
Ribosomal protein S6 kinase alpha-4
Ligand
BDBM31085
Substrate
Meas. Tech.
ChEMBL_774407 (CHEMBL1908624)
Kd
>10000±n/a nM
Citation
 Davis, MIHunt, JPHerrgard, SCiceri, PWodicka, LMPallares, GHocker, MTreiber, DKZarrinkar, PP Comprehensive analysis of kinase inhibitor selectivity. Nat Biotechnol 29:1046-51 (2011)  
Target
Name:
Ribosomal protein S6 kinase alpha-4
Synonyms:
90 kDa ribosomal protein S6 kinase 4 MSK2 Nuclear mitogen- and stress-activated protein kinase 2 RPS6KA4(Kin.Dom.1 - N-terminal) Ribosomal protein S6 kinase Ribosomal protein S6 kinase alpha-4 | Ribosomal protein kinase B
Type:
Serine/threonine-protein kinase
Mol. Mass.:
85620.38
Organism:
Homo sapiens (Human)
Description:
Recombinant MSK2 was phosphorylated by incubation with active p38alpha before assays.
Residue:
772
  
Inhibitor
Name:
BDBM31085
Synonyms:
1-[4-[(4-ethyl-1-piperazinyl)methyl]-3-(trifluoromethyl)phenyl]-3-[4-[[6-(methylamino)-4-pyrimidinyl]oxy]phenyl]urea 1-[4-[(4-ethylpiperazino)methyl]-3-(trifluoromethyl)phenyl]-3-[4-[6-(methylamino)pyrimidin-4-yl]oxyphenyl]urea cid_11409972
Type:
Small organic molecule
Emp. Form.:
C26H30F3N7O2
Mol. Mass.:
529.5573
SMILES:
CCN1CCN(Cc2ccc(NC(=O)Nc3ccc(Oc4cc(NC)ncn4)cc3)cc2C(F)(F)F)CC1
: