Target
SRSF protein kinase 3
Ligand
BDBM31085
Substrate
Meas. Tech.
ChEMBL_774558 (CHEMBL1908775)
Kd
>10000±n/a nM
Citation
 Davis, MIHunt, JPHerrgard, SCiceri, PWodicka, LMPallares, GHocker, MTreiber, DKZarrinkar, PP Comprehensive analysis of kinase inhibitor selectivity. Nat Biotechnol 29:1046-51 (2011)  
Target
Name:
SRSF protein kinase 3
Synonyms:
MSSK-1 Muscle-specific serine kinase 1 SRPK3 SRSF protein kinase 3 Serine/arginine-rich protein-specific kinase 3 Serine/threonine-protein kinase SRPK3
Type:
PROTEIN
Mol. Mass.:
62021.04
Organism:
Homo sapiens (Human)
Description:
ChEMBL_655942
Residue:
567
  
Inhibitor
Name:
BDBM31085
Synonyms:
1-[4-[(4-ethyl-1-piperazinyl)methyl]-3-(trifluoromethyl)phenyl]-3-[4-[[6-(methylamino)-4-pyrimidinyl]oxy]phenyl]urea 1-[4-[(4-ethylpiperazino)methyl]-3-(trifluoromethyl)phenyl]-3-[4-[6-(methylamino)pyrimidin-4-yl]oxyphenyl]urea cid_11409972
Type:
Small organic molecule
Emp. Form.:
C26H30F3N7O2
Mol. Mass.:
529.5573
SMILES:
CCN1CCN(Cc2ccc(NC(=O)Nc3ccc(Oc4cc(NC)ncn4)cc3)cc2C(F)(F)F)CC1
: