Target
Dual specificity mitogen-activated protein kinase kinase 2
Ligand
BDBM31085
Substrate
Meas. Tech.
ChEMBL_774617 (CHEMBL1908834)
Kd
>10000±n/a nM
Citation
 Davis, MIHunt, JPHerrgard, SCiceri, PWodicka, LMPallares, GHocker, MTreiber, DKZarrinkar, PP Comprehensive analysis of kinase inhibitor selectivity. Nat Biotechnol 29:1046-51 (2011)  
Target
Name:
Dual specificity mitogen-activated protein kinase kinase 2
Synonyms:
Dual specificity mitogen-activated protein kinase kinase 2 (MEK2) ERK activator kinase 2 MAP2K2 MAPKK 2 MKK2 PRKMK2 | VHL-MAP2K1/MAP2K2
Type:
Enzyme Catalytic Domain
Mol. Mass.:
44423.61
Organism:
Homo sapiens (Human)
Description:
gi_13489054
Residue:
400
  
Inhibitor
Name:
BDBM31085
Synonyms:
1-[4-[(4-ethyl-1-piperazinyl)methyl]-3-(trifluoromethyl)phenyl]-3-[4-[[6-(methylamino)-4-pyrimidinyl]oxy]phenyl]urea 1-[4-[(4-ethylpiperazino)methyl]-3-(trifluoromethyl)phenyl]-3-[4-[6-(methylamino)pyrimidin-4-yl]oxyphenyl]urea cid_11409972
Type:
Small organic molecule
Emp. Form.:
C26H30F3N7O2
Mol. Mass.:
529.5573
SMILES:
CCN1CCN(Cc2ccc(NC(=O)Nc3ccc(Oc4cc(NC)ncn4)cc3)cc2C(F)(F)F)CC1
: