Target
RAF proto-oncogene serine/threonine-protein kinase
Ligand
BDBM25617
Substrate
Meas. Tech.
ChEMBL_774377 (CHEMBL1908594)
Kd
170±n/a nM
Citation
 Davis, MIHunt, JPHerrgard, SCiceri, PWodicka, LMPallares, GHocker, MTreiber, DKZarrinkar, PP Comprehensive analysis of kinase inhibitor selectivity. Nat Biotechnol 29:1046-51 (2011)  
Target
Name:
RAF proto-oncogene serine/threonine-protein kinase
Synonyms:
C-Raf Protein Kinase RAF RAF1 Raf-1 Serine/threonine-protein kinase C-Raf | cRaf
Type:
Serine/threonine-protein kinase
Mol. Mass.:
73082.52
Organism:
Homo sapiens (Human)
Description:
P04049
Residue:
648
  
Inhibitor
Name:
BDBM25617
Synonyms:
N-[3-({5-chloro-1H-pyrrolo[2,3-b]pyridin-3-yl}carbonyl)-2,4-difluorophenyl]propane-1-sulfonamide | PLX4720
Type:
Small organic molecule
Emp. Form.:
C17H14ClF2N3O3S
Mol. Mass.:
413.826
SMILES:
CCCS(=O)(=O)Nc1ccc(F)c(C(=O)c2c[nH]c3ncc(Cl)cc23)c1F
: