Target
Serine/threonine-protein kinase NIM1
Ligand
BDBM21079
Substrate
Meas. Tech.
ChEMBL_774208 (CHEMBL1908425)
Kd
>10000±n/a nM
Citation
 Davis, MIHunt, JPHerrgard, SCiceri, PWodicka, LMPallares, GHocker, MTreiber, DKZarrinkar, PP Comprehensive analysis of kinase inhibitor selectivity. Nat Biotechnol 29:1046-51 (2011)  
Target
Name:
Serine/threonine-protein kinase NIM1
Synonyms:
NIM1 NIM1_HUMAN
Type:
PROTEIN
Mol. Mass.:
49617.55
Organism:
Homo sapiens (Human)
Description:
ChEMBL_1510633
Residue:
436
  
Inhibitor
Name:
BDBM21079
Synonyms:
1-[4-(3-amino-1H-indazol-4-yl)phenyl]-3-(2-fluoro-5-methyl-phenyl)urea 1-[4-(3-azanyl-1H-indazol-4-yl)phenyl]-3-(2-fluoranyl-5-methyl-phenyl)urea ABT-869 CHEMBL223360 | cid_11485656
Type:
Small organic molecule
Emp. Form.:
C21H18FN5O
Mol. Mass.:
375.3989
SMILES:
Cc1ccc(F)c(NC(=O)Nc2ccc(cc2)-c2cccc3[nH]nc(N)c23)c1
: