Target
Beta-secretase 1
Ligand
BDBM50357706
Substrate
Meas. Tech.
ChEMBL_785501 (CHEMBL1920064)
IC50
240±n/a nM
Citation
 Boy, KMGuernon, JMShi, JToyn, JHMeredith, JEBarten, DMBurton, CRAlbright, CFMarcinkeviciene, JGood, ACTebben, AJMuckelbauer, JKCamac, DMLentz, KABronson, JJOlson, REMacor, JEThompson, LA Monosubstituted¿-lactam and conformationally constrained 1,3-diaminopropan-2-ol transition-state isostere inhibitors ofß-secretase (BACE). Bioorg Med Chem Lett 21:6916-24 (2011)  
Target
Name:
Beta-secretase 1
Synonyms:
ASP2 Aspartyl protease 2 BACE1 Beta-secretase (BACE) Beta-secretase 1 (BACE 1) Beta-secretase 1 (BACE1) Beta-site amyloid precursor protein cleaving enzyme 1 Memapsin-2 beta-Secretase (BACE-1) | beta-Secretase (BACE1)
Type:
Protein
Mol. Mass.:
55755.10
Organism:
Homo sapiens (Human)
Description:
P56817
Residue:
501
  
Inhibitor
Name:
BDBM50357706
Synonyms:
CHEMBL1915976
Type:
Small organic molecule
Emp. Form.:
C36H45F2N3O4
Mol. Mass.:
621.757
SMILES:
COc1cccc(CNC[C@@H](O)[C@H](Cc2cc(F)cc(F)c2)NC(=O)[C@H](CCc2ccccc2)N2CC[C@H](CC(C)C)C2=O)c1
: