Target
5-hydroxytryptamine receptor 2C
Ligand
BDBM50361064
Substrate
Meas. Tech.
ChEMBL_795019 (CHEMBL1936399)
IC50
579±n/a nM
Citation
 Jang, JWBaek, JSChoi, GDPark, WKCho, YSBaek, DJPae, AN 5-HT2c receptor selectivity and structure-activity relationship of N-methyl-N-(1-methylpiperidin-4-yl)benzenesulfonamide analogs. Bioorg Med Chem Lett 22:347-52 (2011)  
Target
Name:
5-hydroxytryptamine receptor 2C
Synonyms:
5-HT-1C 5-HT1C 5-HT2C-INI 5-HTR2C 5-hydroxytryptamine receptor 2C (5-HT-2C) 5HT-1C HTR1C Serotonin (5-HT3) receptor Serotonin Receptor 2C
Type:
G Protein-Coupled Receptor (GPCR)
Mol. Mass.:
51836.79
Organism:
Homo sapiens (Human)
Description:
P28335
Residue:
458
  
Inhibitor
Name:
BDBM50361064
Synonyms:
CHEMBL1933411
Type:
Small organic molecule
Emp. Form.:
C14H22N2O2S
Mol. Mass.:
282.402
SMILES:
CN(C1CCN(C)CC1)S(=O)(=O)c1cccc(C)c1
: