Target
Histone deacetylase 8
Ligand
BDBM50361265
Substrate
Meas. Tech.
ChEMBL_795339 (CHEMBL1937195)
Kd
60000±n/a nM
Citation
 Henkes, LMHaus, PJäger, FLudwig, JMeyer-Almes, FJ Synthesis and biochemical analysis of 2,2,3,3,4,4,5,5,6,6,7,7-dodecafluoro-N-hydroxy-octanediamides as inhibitors of human histone deacetylases. Bioorg Med Chem 20:985-95 (2012)  
Target
Name:
Histone deacetylase 8
Synonyms:
HD8 HDAC8_HUMAN Histone deacetylase 8 (HDAC-8) | Human HDAC8
Type:
Enzyme
Mol. Mass.:
41749.60
Organism:
Homo sapiens (Human)
Description:
Q9BY41
Residue:
377
  
Inhibitor
Name:
BDBM50361265
Synonyms:
CHEMBL1934907
Type:
Small organic molecule
Emp. Form.:
C22H12F12N2O3
Mol. Mass.:
580.3231
SMILES:
ONC(=O)C(F)(F)C(F)(F)C(F)(F)C(F)(F)C(F)(F)C(F)(F)C(=O)Nc1ccc2cc3ccccc3cc2c1
: