Target
Free fatty acid receptor 1
Ligand
BDBM50362690
Substrate
Meas. Tech.
ChEMBL_797514 (CHEMBL1943344)
EC50
13±n/a nM
Citation
 Houze, JBZhu, LSun, YAkerman, MQiu, WZhang, AJSharma, RSchmitt, MWang, YLiu, JLiu, JMedina, JCReagan, JDLuo, JTonn, GZhang, JLu, JYChen, MLopez, ENguyen, KYang, LTang, LTian, HShuttleworth, SJLin, DC AMG 837: a potent, orally bioavailable GPR40 agonist. Bioorg Med Chem Lett 22:1267-70 (2012)  
Target
Name:
Free fatty acid receptor 1
Synonyms:
FFAR1_MOUSE Gpr40
Type:
PROTEIN
Mol. Mass.:
31818.80
Organism:
Mus musculus
Description:
ChEMBL_1454431
Residue:
300
  
Inhibitor
Name:
BDBM50362690
Synonyms:
AMG-837 | CHEMBL1829173
Type:
Small organic molecule
Emp. Form.:
C26H21F3O3
Mol. Mass.:
438.4383
SMILES:
CC#C[C@@H](CC(O)=O)c1ccc(OCc2cccc(c2)-c2ccc(cc2)C(F)(F)F)cc1
: