Target
Free fatty acid receptor 1
Ligand
BDBM50362692
Substrate
Meas. Tech.
ChEMBL_797511 (CHEMBL1943341)
EC50
3200±n/a nM
Citation
 Houze, JBZhu, LSun, YAkerman, MQiu, WZhang, AJSharma, RSchmitt, MWang, YLiu, JLiu, JMedina, JCReagan, JDLuo, JTonn, GZhang, JLu, JYChen, MLopez, ENguyen, KYang, LTang, LTian, HShuttleworth, SJLin, DC AMG 837: a potent, orally bioavailable GPR40 agonist. Bioorg Med Chem Lett 22:1267-70 (2012)  
Target
Name:
Free fatty acid receptor 1
Synonyms:
FFAR1 G-protein Coupled Receptor 40 | GPR40
Type:
G Protein-Coupled Receptor (GPCR)
Mol. Mass.:
31473.32
Organism:
Homo sapiens (Human)
Description:
O14842
Residue:
300
  
Inhibitor
Name:
BDBM50362692
Synonyms:
CHEMBL1939638
Type:
Small organic molecule
Emp. Form.:
C19H22O4
Mol. Mass.:
314.3756
SMILES:
CCC(CC(O)=O)c1ccc(OCc2ccc(OC)cc2)cc1
: