Target
Aminopeptidase N
Ligand
BDBM50078135
Substrate
Meas. Tech.
ChEBML_35500
Ki
3.8±n/a nM
Citation
 Chen, HRoques, BPFournié-Zaluski, MC Design of the first highly potent and selective aminopeptidase N (EC 3.4.11.2) inhibitor. Bioorg Med Chem Lett 9:1511-6 (1999)  
Target
Name:
Aminopeptidase N
Synonyms:
AMPN_PIG AP-M Alanyl aminopeptidase Aminopeptidase N (APN) Microsomal aminopeptidase pAPN
Type:
Protein
Mol. Mass.:
108810.25
Organism:
Sus scrofa (Pig)
Description:
P15145
Residue:
963
  
Inhibitor
Name:
BDBM50078135
Synonyms:
2-{3-[(Amino-phenyl-methyl)-hydroxy-phosphinoyl]-2-benzyl-propionylamino}-3-phenyl-propionic acid | CHEMBL36588
Type:
Small organic molecule
Emp. Form.:
C26H29N2O5P
Mol. Mass.:
480.4926
SMILES:
OC(=O)C(Cc1ccccc1)NC(=O)C(Cc1ccccc1)CP(O)(O)C(=N)c1ccccc1
: