Target
Aminopeptidase N
Ligand
BDBM50078134
Substrate
Meas. Tech.
ChEMBL_35501 (CHEMBL646411)
Ki
2.9±n/a nM
Citation
 Chen, HRoques, BPFournié-Zaluski, MC Design of the first highly potent and selective aminopeptidase N (EC 3.4.11.2) inhibitor. Bioorg Med Chem Lett 9:1511-6 (1999)  
Target
Name:
Aminopeptidase N
Synonyms:
AMPN_PIG AP-M Alanyl aminopeptidase Aminopeptidase N (APN) Microsomal aminopeptidase pAPN
Type:
Protein
Mol. Mass.:
108810.25
Organism:
Sus scrofa (Pig)
Description:
P15145
Residue:
963
  
Inhibitor
Name:
BDBM50078134
Synonyms:
2-{3-[(1-Amino-2-phenyl-ethyl)-hydroxy-phosphinoyl]-2-benzyl-propionylamino}-3-phenyl-propionic acid | CHEMBL39422
Type:
Small organic molecule
Emp. Form.:
C27H31N2O5P
Mol. Mass.:
494.5192
SMILES:
OC(=O)C(Cc1ccccc1)NC(=O)C(Cc1ccccc1)CP(O)(O)C(=N)Cc1ccccc1
: