Target
Aminopeptidase N
Ligand
BDBM50078131
Substrate
Meas. Tech.
ChEMBL_35501 (CHEMBL646411)
Ki
3.2±n/a nM
Citation
 Chen, HRoques, BPFournié-Zaluski, MC Design of the first highly potent and selective aminopeptidase N (EC 3.4.11.2) inhibitor. Bioorg Med Chem Lett 9:1511-6 (1999)  
Target
Name:
Aminopeptidase N
Synonyms:
AMPN_PIG AP-M Alanyl aminopeptidase Aminopeptidase N (APN) Microsomal aminopeptidase pAPN
Type:
Protein
Mol. Mass.:
108810.25
Organism:
Sus scrofa (Pig)
Description:
P15145
Residue:
963
  
Inhibitor
Name:
BDBM50078131
Synonyms:
2-{3-[(1-Amino-3-methyl-butyl)-hydroxy-phosphinoyl]-2-benzyl-propionylamino}-3-phenyl-propionic acid | CHEMBL290357
Type:
Small organic molecule
Emp. Form.:
C24H33N2O5P
Mol. Mass.:
460.503
SMILES:
CC(C)CC(=N)P(O)(O)CC(Cc1ccccc1)C(=O)NC(Cc1ccccc1)C(O)=O
: