Target
Prothrombin
Ligand
BDBM50107459
Substrate
Meas. Tech.
ChEBML_207982
IC50
8900±n/a nM
Citation
 Das, JKimball, SDHall, SEHan, WCIwanowicz, ELin, JMoquin, RVReid, JASack, JSMalley, MFChang, CYChong, SWang-Iverson, DBRoberts, DGSeiler, SMSchumacher, WAOgletree, ML Molecular design and structure--activity relationships leading to the potent, selective, and orally active thrombin active site inhibitor BMS-189664. Bioorg Med Chem Lett 12:45-9 (2001)  
Target
Name:
Prothrombin
Synonyms:
Activation peptide fragment 1 Coagulation factor II Prothrombin precursor Thrombin heavy chain | Thrombin light chain
Type:
Protein
Mol. Mass.:
70029.57
Organism:
Homo sapiens (Human)
Description:
P00734
Residue:
622
  
Inhibitor
Name:
BDBM50107459
Synonyms:
(S)-1-[(R)-3-(1H-Indol-3-yl)-2-(naphthalene-2-sulfonylamino)-propionyl]-pyrrolidine-2-carboxylic acid (4-guanidino-butyl)-amide | CHEMBL435824
Type:
Small organic molecule
Emp. Form.:
C31H37N7O4S
Mol. Mass.:
603.735
SMILES:
NC(=N)NCCCCNC(=O)[C@@H]1CCCN1C(=O)[C@@H](Cc1c[nH]c2ccccc12)NS(=O)(=O)c1ccc2ccccc2c1
: