Target
Prothrombin
Ligand
BDBM50107461
Substrate
Meas. Tech.
ChEBML_207982
IC50
10±n/a nM
Citation
 Das, JKimball, SDHall, SEHan, WCIwanowicz, ELin, JMoquin, RVReid, JASack, JSMalley, MFChang, CYChong, SWang-Iverson, DBRoberts, DGSeiler, SMSchumacher, WAOgletree, ML Molecular design and structure--activity relationships leading to the potent, selective, and orally active thrombin active site inhibitor BMS-189664. Bioorg Med Chem Lett 12:45-9 (2001)  
Target
Name:
Prothrombin
Synonyms:
Activation peptide fragment 1 Coagulation factor II Prothrombin precursor Thrombin heavy chain | Thrombin light chain
Type:
Protein
Mol. Mass.:
70029.57
Organism:
Homo sapiens (Human)
Description:
P00734
Residue:
622
  
Inhibitor
Name:
BDBM50107461
Synonyms:
(S)-1-((R)-3-Phenyl-2-phenylmethanesulfonylamino-propionyl)-pyrrolidine-2-carboxylic acid (1-carbamimidoyl-piperidin-4-ylmethyl)-amide | CHEMBL148208
Type:
Small organic molecule
Emp. Form.:
C28H38N6O4S
Mol. Mass.:
554.704
SMILES:
NC(=N)N1CCC(CNC(=O)[C@@H]2CCCN2C(=O)[C@@H](Cc2ccccc2)NS(=O)(=O)Cc2ccccc2)CC1
: