Target
Prothrombin
Ligand
BDBM50107462
Substrate
Meas. Tech.
ChEBML_207982
IC50
3000±n/a nM
Citation
 Das, JKimball, SDHall, SEHan, WCIwanowicz, ELin, JMoquin, RVReid, JASack, JSMalley, MFChang, CYChong, SWang-Iverson, DBRoberts, DGSeiler, SMSchumacher, WAOgletree, ML Molecular design and structure--activity relationships leading to the potent, selective, and orally active thrombin active site inhibitor BMS-189664. Bioorg Med Chem Lett 12:45-9 (2001)  
Target
Name:
Prothrombin
Synonyms:
Activation peptide fragment 1 Coagulation factor II Prothrombin precursor Thrombin heavy chain | Thrombin light chain
Type:
Protein
Mol. Mass.:
70029.57
Organism:
Homo sapiens (Human)
Description:
P00734
Residue:
622
  
Inhibitor
Name:
BDBM50107462
Synonyms:
(S)-1-[(2S,3S)-3-Hydroxy-2-(naphthalene-2-sulfonylamino)-butyryl]-pyrrolidine-2-carboxylic acid (4-guanidino-butyl)-amide | CHEMBL145398
Type:
Small organic molecule
Emp. Form.:
C24H34N6O5S
Mol. Mass.:
518.629
SMILES:
CC(O)[C@H](NS(=O)(=O)c1ccc2ccccc2c1)C(=O)N1CCC[C@H]1C(=O)NCCCCNC(N)=N
: