Target
Prothrombin
Ligand
BDBM50107464
Substrate
Meas. Tech.
ChEBML_207982
IC50
>333000±n/a nM
Citation
 Das, JKimball, SDHall, SEHan, WCIwanowicz, ELin, JMoquin, RVReid, JASack, JSMalley, MFChang, CYChong, SWang-Iverson, DBRoberts, DGSeiler, SMSchumacher, WAOgletree, ML Molecular design and structure--activity relationships leading to the potent, selective, and orally active thrombin active site inhibitor BMS-189664. Bioorg Med Chem Lett 12:45-9 (2001)  
Target
Name:
Prothrombin
Synonyms:
Activation peptide fragment 1 Coagulation factor II Prothrombin precursor Thrombin heavy chain | Thrombin light chain
Type:
Protein
Mol. Mass.:
70029.57
Organism:
Homo sapiens (Human)
Description:
P00734
Residue:
622
  
Inhibitor
Name:
BDBM50107464
Synonyms:
(R)-5-[(S)-2-(4-Guanidino-butylcarbamoyl)-pyrrolidin-1-yl]-4-(naphthalene-2-sulfonylamino)-5-oxo-pentanoic acid | CHEMBL144992
Type:
Small organic molecule
Emp. Form.:
C25H34N6O6S
Mol. Mass.:
546.639
SMILES:
NC(=N)NCCCCNC(=O)[C@@H]1CCCN1C(=O)[C@@H](CCC(O)=O)NS(=O)(=O)c1ccc2ccccc2c1
: