Target
Prothrombin
Ligand
BDBM50107465
Substrate
Meas. Tech.
ChEBML_207982
IC50
110000±n/a nM
Citation
 Das, JKimball, SDHall, SEHan, WCIwanowicz, ELin, JMoquin, RVReid, JASack, JSMalley, MFChang, CYChong, SWang-Iverson, DBRoberts, DGSeiler, SMSchumacher, WAOgletree, ML Molecular design and structure--activity relationships leading to the potent, selective, and orally active thrombin active site inhibitor BMS-189664. Bioorg Med Chem Lett 12:45-9 (2001)  
Target
Name:
Prothrombin
Synonyms:
Activation peptide fragment 1 Coagulation factor II Prothrombin precursor Thrombin heavy chain | Thrombin light chain
Type:
Protein
Mol. Mass.:
70029.57
Organism:
Homo sapiens (Human)
Description:
P00734
Residue:
622
  
Inhibitor
Name:
BDBM50107465
Synonyms:
(S)-1-((R)-3-Phenyl-2-trifluoromethanesulfonylamino-propionyl)-pyrrolidine-2-carboxylic acid (4-guanidino-butyl)-amide | CHEMBL341641
Type:
Small organic molecule
Emp. Form.:
C20H29F3N6O4S
Mol. Mass.:
506.542
SMILES:
NC(=N)NCCCCNC(=O)[C@@H]1CCCN1C(=O)[C@@H](Cc1ccccc1)NS(=O)(=O)C(F)(F)F
: