Target
Prothrombin
Ligand
BDBM50107468
Substrate
Meas. Tech.
ChEBML_207982
IC50
26600±n/a nM
Citation
 Das, JKimball, SDHall, SEHan, WCIwanowicz, ELin, JMoquin, RVReid, JASack, JSMalley, MFChang, CYChong, SWang-Iverson, DBRoberts, DGSeiler, SMSchumacher, WAOgletree, ML Molecular design and structure--activity relationships leading to the potent, selective, and orally active thrombin active site inhibitor BMS-189664. Bioorg Med Chem Lett 12:45-9 (2001)  
Target
Name:
Prothrombin
Synonyms:
Activation peptide fragment 1 Coagulation factor II Prothrombin precursor Thrombin heavy chain | Thrombin light chain
Type:
Protein
Mol. Mass.:
70029.57
Organism:
Homo sapiens (Human)
Description:
P00734
Residue:
622
  
Inhibitor
Name:
BDBM50107468
Synonyms:
(S)-1-[4-Carbamoyl-2-((S)-naphthalene-2-sulfonylamino)-butyryl]-pyrrolidine-2-carboxylic acid (4-guanidino-butyl)-amide | CHEMBL144859
Type:
Small organic molecule
Emp. Form.:
C25H35N7O5S
Mol. Mass.:
545.654
SMILES:
NC(=O)CC[C@@H](NS(=O)(=O)c1ccc2ccccc2c1)C(=O)N1CCC[C@H]1C(=O)NCCCCNC(N)=N
: