Target
Prothrombin
Ligand
BDBM50107467
Substrate
Meas. Tech.
ChEBML_207982
IC50
108000±n/a nM
Citation
 Das, JKimball, SDHall, SEHan, WCIwanowicz, ELin, JMoquin, RVReid, JASack, JSMalley, MFChang, CYChong, SWang-Iverson, DBRoberts, DGSeiler, SMSchumacher, WAOgletree, ML Molecular design and structure--activity relationships leading to the potent, selective, and orally active thrombin active site inhibitor BMS-189664. Bioorg Med Chem Lett 12:45-9 (2001)  
Target
Name:
Prothrombin
Synonyms:
Activation peptide fragment 1 Coagulation factor II Prothrombin precursor Thrombin heavy chain | Thrombin light chain
Type:
Protein
Mol. Mass.:
70029.57
Organism:
Homo sapiens (Human)
Description:
P00734
Residue:
622
  
Inhibitor
Name:
BDBM50107467
Synonyms:
(S)-1-((R)-2-Methanesulfonylamino-3-phenyl-propionyl)-pyrrolidine-2-carboxylic acid (3-imidazol-1-yl-propyl)-amide | CHEMBL144702
Type:
Small organic molecule
Emp. Form.:
C21H29N5O4S
Mol. Mass.:
447.551
SMILES:
CS(=O)(=O)N[C@H](Cc1ccccc1)C(=O)N1CCC[C@H]1C(=O)NCCCn1ccnc1
: