Target
Prothrombin
Ligand
BDBM50064652
Substrate
Meas. Tech.
ChEBML_207982
IC50
540±n/a nM
Citation
 Das, JKimball, SDHall, SEHan, WCIwanowicz, ELin, JMoquin, RVReid, JASack, JSMalley, MFChang, CYChong, SWang-Iverson, DBRoberts, DGSeiler, SMSchumacher, WAOgletree, ML Molecular design and structure--activity relationships leading to the potent, selective, and orally active thrombin active site inhibitor BMS-189664. Bioorg Med Chem Lett 12:45-9 (2001)  
Target
Name:
Prothrombin
Synonyms:
Activation peptide fragment 1 Coagulation factor II Prothrombin precursor Thrombin heavy chain | Thrombin light chain
Type:
Protein
Mol. Mass.:
70029.57
Organism:
Homo sapiens (Human)
Description:
P00734
Residue:
622
  
Inhibitor
Name:
BDBM50064652
Synonyms:
(S)-1-((R)-2-Amino-3-phenyl-propionyl)-pyrrolidine-2-carboxylic acid (4-guanidino-butyl)-amide D-Phe-Pro-p-Amidinobenzylamine analogue
Type:
Small organic molecule
Emp. Form.:
C19H30N6O2
Mol. Mass.:
374.4805
SMILES:
N[C@H](Cc1ccccc1)C(=O)N1CCC[C@H]1C(=O)NCCCCNC(N)=N
: