Target
Prothrombin
Ligand
BDBM50107471
Substrate
Meas. Tech.
ChEBML_207982
IC50
2900±n/a nM
Citation
 Das, JKimball, SDHall, SEHan, WCIwanowicz, ELin, JMoquin, RVReid, JASack, JSMalley, MFChang, CYChong, SWang-Iverson, DBRoberts, DGSeiler, SMSchumacher, WAOgletree, ML Molecular design and structure--activity relationships leading to the potent, selective, and orally active thrombin active site inhibitor BMS-189664. Bioorg Med Chem Lett 12:45-9 (2001)  
Target
Name:
Prothrombin
Synonyms:
Activation peptide fragment 1 Coagulation factor II Prothrombin precursor Thrombin heavy chain | Thrombin light chain
Type:
Protein
Mol. Mass.:
70029.57
Organism:
Homo sapiens (Human)
Description:
P00734
Residue:
622
  
Inhibitor
Name:
BDBM50107471
Synonyms:
(S)-1-[2-(Naphthalene-2-sulfonylamino)-acetyl]-pyrrolidine-2-carboxylic acid (4-guanidino-butyl)-amide | CHEMBL145896
Type:
Small organic molecule
Emp. Form.:
C22H30N6O4S
Mol. Mass.:
474.576
SMILES:
NC(=N)NCCCCNC(=O)[C@@H]1CCCN1C(=O)CNS(=O)(=O)c1ccc2ccccc2c1
: