Target
Prothrombin
Ligand
BDBM50107473
Substrate
Meas. Tech.
ChEBML_207982
IC50
70±n/a nM
Citation
 Das, JKimball, SDHall, SEHan, WCIwanowicz, ELin, JMoquin, RVReid, JASack, JSMalley, MFChang, CYChong, SWang-Iverson, DBRoberts, DGSeiler, SMSchumacher, WAOgletree, ML Molecular design and structure--activity relationships leading to the potent, selective, and orally active thrombin active site inhibitor BMS-189664. Bioorg Med Chem Lett 12:45-9 (2001)  
Target
Name:
Prothrombin
Synonyms:
Activation peptide fragment 1 Coagulation factor II Prothrombin precursor Thrombin heavy chain | Thrombin light chain
Type:
Protein
Mol. Mass.:
70029.57
Organism:
Homo sapiens (Human)
Description:
P00734
Residue:
622
  
Inhibitor
Name:
BDBM50107473
Synonyms:
(S)-1-((R)-2-Methanesulfonylamino-3-phenyl-propionyl)-pyrrolidine-2-carboxylic acid [1-(N-hydroxycarbamimidoyl)-piperidin-4-ylmethyl]-amide | CHEMBL147430
Type:
Small organic molecule
Emp. Form.:
C22H34N6O5S
Mol. Mass.:
494.608
SMILES:
CS(=O)(=O)N[C@H](Cc1ccccc1)C(=O)N1CCC[C@H]1C(=O)NCC1CCN(CC1)C(=N)NO
: