Target
Phenylethanolamine N-methyltransferase
Ligand
BDBM13017
Substrate
Meas. Tech.
ChEBML_153309
Ki
550±n/a nM
Citation
 Sall, DJGrunewald, GL Inhibition of phenylethanolamine N-methyltransferase (PNMT) by aromatic hydroxy-substituted 1,2,3,4,-tetrahydroisoquinolines: further studies on the hydrophilic pocket of the aromatic ring binding region of the active site. J Med Chem 30:2208-16 (1988)  
Target
Name:
Phenylethanolamine N-methyltransferase
Synonyms:
Noradrenaline N-methyltransferase PNMT_BOVIN | PNMTase
Type:
Enzyme
Mol. Mass.:
30916.97
Organism:
Bos taurus (bovine)
Description:
Residue:
283
  
Inhibitor
Name:
BDBM13017
Synonyms:
1,2,3,4-tetrahydroisoquinoline-7-sulfonamide SKF 29661
Type:
Small organic molecule
Emp. Form.:
C9H12N2O2S
Mol. Mass.:
212.269
SMILES:
NS(=O)(=O)c1ccc2CCNCc2c1
: