Target
Phenylethanolamine N-methyltransferase
Ligand
BDBM50024843
Substrate
Meas. Tech.
ChEBML_153309
Ki
487000±n/a nM
Citation
 Sall, DJGrunewald, GL Inhibition of phenylethanolamine N-methyltransferase (PNMT) by aromatic hydroxy-substituted 1,2,3,4,-tetrahydroisoquinolines: further studies on the hydrophilic pocket of the aromatic ring binding region of the active site. J Med Chem 30:2208-16 (1988)  
Target
Name:
Phenylethanolamine N-methyltransferase
Synonyms:
Noradrenaline N-methyltransferase PNMT_BOVIN | PNMTase
Type:
Enzyme
Mol. Mass.:
30916.97
Organism:
Bos taurus (bovine)
Description:
Residue:
283
  
Inhibitor
Name:
BDBM50024843
Synonyms:
2-Amino-1,2,3,4-tetrahydro-1,4-methano-naphthalene-6,7-diol | CHEMBL61595
Type:
Small organic molecule
Emp. Form.:
C11H13NO2
Mol. Mass.:
191.2264
SMILES:
N[C@@H]1CC2CC1c1cc(O)c(O)cc21
: