Target
UDP-N-acetylmuramoyl-tripeptide--D-alanyl-D-alanine ligase
Ligand
BDBM50022572
Substrate
Meas. Tech.
ChEMBL_52572 (CHEMBL664608)
IC50
165000±n/a nM
Citation
 Parsons, WHPatchett, AABull, HGSchoen, WRTaub, DDavidson, JCombs, PLSpringer, JPGadebusch, HWeissberger, B Phosphinic acid inhibitors of D-alanyl-D-alanine ligase. J Med Chem 31:1772-8 (1988)  
Target
Name:
UDP-N-acetylmuramoyl-tripeptide--D-alanyl-D-alanine ligase
Synonyms:
Type:
PROTEIN
Mol. Mass.:
50136.19
Organism:
Staphylococcus epidermidis (strain ATCC 35984 / RP62A)
Description:
ChEMBL_52572
Residue:
451
  
Inhibitor
Name:
BDBM50022572
Synonyms:
3-[(1-Amino-ethyl)-hydroxy-phosphinoyl]-2-methyl-propionic acid;hydrate CHEMBL2093127 | CHEMBL49180
Type:
Small organic molecule
Emp. Form.:
C6H14NO4P
Mol. Mass.:
195.1534
SMILES:
CC(CP(O)(O)C(C)=N)C(O)=O
: