Target
UDP-N-acetylmuramoyl-tripeptide--D-alanyl-D-alanine ligase
Ligand
BDBM50022580
Substrate
Meas. Tech.
ChEBML_52572
IC50
40000±n/a nM
Citation
 Parsons, WHPatchett, AABull, HGSchoen, WRTaub, DDavidson, JCombs, PLSpringer, JPGadebusch, HWeissberger, B Phosphinic acid inhibitors of D-alanyl-D-alanine ligase. J Med Chem 31:1772-8 (1988)  
Target
Name:
UDP-N-acetylmuramoyl-tripeptide--D-alanyl-D-alanine ligase
Synonyms:
Type:
PROTEIN
Mol. Mass.:
50136.19
Organism:
Staphylococcus epidermidis (strain ATCC 35984 / RP62A)
Description:
ChEMBL_52572
Residue:
451
  
Inhibitor
Name:
BDBM50022580
Synonyms:
2-[(1-Amino-ethyl)-hydroxy-phosphinoylmethyl]-4-phenyl-butyric acid;hydrate | CHEMBL298715
Type:
Small organic molecule
Emp. Form.:
C13H20NO4P
Mol. Mass.:
285.276
SMILES:
CC(=N)P(O)(O)CC(CCc1ccccc1)C(O)=O
: