Target
Aminopeptidase N
Ligand
BDBM50083398
Substrate
Meas. Tech.
ChEMBL_35498 (CHEMBL646408)
Ki
>10000±n/a nM
Citation
 David, CBischoff, LMeudal, HMothé, ADe Mota, NDaNascimento, SLlorens-Cortes, CFournié-Zaluski, MCRoques, BP Investigation of subsite preferences in aminopeptidase A (EC 3.4.11.7) led to the design of the first highly potent and selective inhibitors of this enzyme. J Med Chem 42:5197-211 (2000)  
Target
Name:
Aminopeptidase N
Synonyms:
AMPN_PIG AP-M Alanyl aminopeptidase Aminopeptidase N (APN) Microsomal aminopeptidase pAPN
Type:
Protein
Mol. Mass.:
108810.25
Organism:
Sus scrofa (Pig)
Description:
P15145
Residue:
963
  
Inhibitor
Name:
BDBM50083398
Synonyms:
(3R,4R)-3-ammonio-5-{[(1S)-1-carboxy-2-methylbutyl]amino}-4-mercapto-5-oxopentane-1-sulfonate | CHEMBL149449
Type:
Small organic molecule
Emp. Form.:
C11H22N2O6S2
Mol. Mass.:
342.432
SMILES:
CC[C@@H](C)[C@H](NC(=O)[C@H](S)[C@H]([NH3+])CCS([O-])(=O)=O)C(O)=O
: