Target
Oxytocin receptor
Ligand
BDBM50370106
Substrate
Meas. Tech.
ChEMBL_149044 (CHEMBL762237)
Ki
0.21±n/a nM
Citation
 Terrillon, SCheng, LLStoev, SMouillac, BBarberis, CManning, MDurroux, T Synthesis and characterization of fluorescent antagonists and agonists for human oxytocin and vasopressin V(1)(a) receptors. J Med Chem 45:2579-88 (2002)  
Target
Name:
Oxytocin receptor
Synonyms:
OT-R OXYR_HUMAN | Oxytocin
Type:
Enzyme Catalytic Domain
Mol. Mass.:
42793.26
Organism:
Homo sapiens (Human)
Description:
Oxytocin OXTR HEK293::B2R9L7
Residue:
389
  
Inhibitor
Name:
BDBM50370106
Synonyms:
CHEMBL1790712
Type:
Small organic molecule
Emp. Form.:
C52H75N11O13S2
Mol. Mass.:
1126.348
SMILES:
CC[C@@H](C)[C@H]1NC(=O)[C@](C)(NC(=O)CC2(CCCCC2)SSC[C@@H](NC(=O)[C@@H](CC(N)=O)NC(=O)[C@H](NC1=O)[C@@H](C)O)C(=O)N1CCC[C@@H]1C(=O)N[C@@H](CCCN)C(=O)N[C@H](C(N)=O)c1ccc(O)cc1)c1ccc(O)cc1
: