Target
Vasopressin V1a receptor
Ligand
BDBM50370106
Substrate
Meas. Tech.
ChEMBL_214413 (CHEMBL820277)
Ki
3.9±n/a nM
Citation
 Terrillon, SCheng, LLStoev, SMouillac, BBarberis, CManning, MDurroux, T Synthesis and characterization of fluorescent antagonists and agonists for human oxytocin and vasopressin V(1)(a) receptors. J Med Chem 45:2579-88 (2002)  
Target
Name:
Vasopressin V1a receptor
Synonyms:
AVPR V1a AVPR1A V1AR_HUMAN VASOPRESSIN V1A Vasopressin V1 receptor Vasopressin receptor
Type:
Receptor
Mol. Mass.:
46820.18
Organism:
Homo sapiens (Human)
Description:
P37288
Residue:
418
  
Inhibitor
Name:
BDBM50370106
Synonyms:
CHEMBL1790712
Type:
Small organic molecule
Emp. Form.:
C52H75N11O13S2
Mol. Mass.:
1126.348
SMILES:
CC[C@@H](C)[C@H]1NC(=O)[C@](C)(NC(=O)CC2(CCCCC2)SSC[C@@H](NC(=O)[C@@H](CC(N)=O)NC(=O)[C@H](NC1=O)[C@@H](C)O)C(=O)N1CCC[C@@H]1C(=O)N[C@@H](CCCN)C(=O)N[C@H](C(N)=O)c1ccc(O)cc1)c1ccc(O)cc1
: