Target
Leukotriene A-4 hydrolase
Ligand
BDBM50116560
Substrate
Meas. Tech.
ChEMBL_96939 (CHEMBL706180)
IC50
2±n/a nM
Citation
 Penning, TDRussell, MAChen, BBChen, HYLiang, CDMahoney, MWMalecha, JWMiyashiro, JMYu, SSAskonas, LJGierse, JKHarding, EIHighkin, MKKachur, JFKim, SHVillani-Price, DPyla, EYGhoreishi-Haack, NSSmith, WG Synthesis of potent leukotriene A(4) hydrolase inhibitors. Identification of 3-[methyl[3-[4-(phenylmethyl)phenoxy]propyl]amino]propanoic acid. J Med Chem 45:3482-90 (2002)  
Target
Name:
Leukotriene A-4 hydrolase
Synonyms:
LKHA4_HUMAN LTA4 Leukotriene A(4) hydrolase Leukotriene A4 hydrolase
Type:
Hydrolase; metalloprotease
Mol. Mass.:
69280.41
Organism:
Homo sapiens (Human)
Description:
Human recombinant LTA4H.
Residue:
611
  
Inhibitor
Name:
BDBM50116560
Synonyms:
3-{Methyl-[3-(4-thiophen-3-ylmethyl-phenoxy)-propyl]-amino}-propionic acid | CHEMBL326601
Type:
Small organic molecule
Emp. Form.:
C18H23NO3S
Mol. Mass.:
333.445
SMILES:
CN(CCCOc1ccc(Cc2ccsc2)cc1)CCC(O)=O
: