Target
Cannabinoid receptor 2
Ligand
BDBM50128093
Substrate
Meas. Tech.
ChEMBL_46981 (CHEMBL659748)
Ki
146±n/a nM
Citation
 Wrobleski, STChen, PHynes, JLin, SNorris, DJPandit, CRSpergel, SWu, HTokarski, JSChen, XGillooly, KMKiener, PAMcIntyre, KWPatil-Koota, VShuster, DJTurk, LAYang, GLeftheris, K Rational design and synthesis of an orally active indolopyridone as a novel conformationally constrained cannabinoid ligand possessing antiinflammatory properties. J Med Chem 46:2110-6 (2003)  
Target
Name:
Cannabinoid receptor 2
Synonyms:
CANNABINOID CB2 CB2 CB2B CNR2_HUMAN Cannabinoid CB2 receptor Cannabinoid receptor 2 (CB2R) | hCB2
Type:
G Protein-Coupled Receptor (GPCR)
Mol. Mass.:
39690.94
Organism:
Homo sapiens (Human)
Description:
P34972
Residue:
360
  
Inhibitor
Name:
BDBM50128093
Synonyms:
7-Methoxy-1-(2-morpholin-4-yl-ethyl)-1H-indazole-3-carboxylic acid (phenyl-pyridin-2-yl-methyl)-amide | CHEMBL66956
Type:
Small organic molecule
Emp. Form.:
C27H29N5O3
Mol. Mass.:
471.5509
SMILES:
COc1cccc2c(nn(CCN3CCOCC3)c12)C(=O)NC(c1ccccc1)c1ccccn1
: