Target
Cannabinoid receptor 2
Ligand
BDBM50128097
Substrate
Meas. Tech.
ChEMBL_46981 (CHEMBL659748)
Ki
77±n/a nM
Citation
 Wrobleski, STChen, PHynes, JLin, SNorris, DJPandit, CRSpergel, SWu, HTokarski, JSChen, XGillooly, KMKiener, PAMcIntyre, KWPatil-Koota, VShuster, DJTurk, LAYang, GLeftheris, K Rational design and synthesis of an orally active indolopyridone as a novel conformationally constrained cannabinoid ligand possessing antiinflammatory properties. J Med Chem 46:2110-6 (2003)  
Target
Name:
Cannabinoid receptor 2
Synonyms:
CANNABINOID CB2 CB2 CB2B CNR2_HUMAN Cannabinoid CB2 receptor Cannabinoid receptor 2 (CB2R) | hCB2
Type:
G Protein-Coupled Receptor (GPCR)
Mol. Mass.:
39690.94
Organism:
Homo sapiens (Human)
Description:
P34972
Residue:
360
  
Inhibitor
Name:
BDBM50128097
Synonyms:
7-Methoxy-1-(2-morpholin-4-yl-ethyl)-1H-indazole-3-carboxylic acid 2-methoxy-benzylamide | CHEMBL63365
Type:
Small organic molecule
Emp. Form.:
C23H28N4O4
Mol. Mass.:
424.4928
SMILES:
COc1ccccc1CNC(=O)c1nn(CCN2CCOCC2)c2c(OC)cccc12
: